Reaction Details
TargetTyrosine-protein kinase ABL1
LigandBDBM50343425
Substrate/Competitorn/a
Meas. Tech.ChEMBL_745920 (CHEMBL1776290)
Ki 390±n/a nM
Citation Radi, MDreassi, EBrullo, CCrespan, ETintori, CBernardo, VValoti, MZamperini, CDaigl, HMusumeci, FCarraro, FNaldini, AFilippi, IMaga, GSchenone, SBotta, M Design, synthesis, biological activity, and ADME properties of pyrazolo[3,4-d]pyrimidines active in hypoxic human leukemia cells: a lead optimization study. J Med Chem54:2610-26 (2011) 
 
Tyrosine-protein kinase ABL1
Name:Tyrosine-protein kinase ABL1
Type:Enzyme
Mol. Mass.:122897.30
Organism:Homo sapiens (Human)
Description:P00519
Residue:1130
BDBM50343425
NameBDBM50343425
Synonyms:CHEMBL1775041 | N-(3-Chlorophenyl)-1-(2-chloro-2-phenylethyl)-6-morpholin-4-yl-1H-pyrazolo[3,4-d]pyrimidin-4-amine
TypeSmall organic molecule
Emp. Form.C23H22Cl2N6O
Mol. Mass.469.366
SMILESClC(Cn1ncc2c(Nc3cccc(Cl)c3)nc(nc12)N1CCOCC1)c1ccccc1