Reaction Details
TargetTyrosine-protein kinase ABL1
LigandBDBM50343427
Substrate/Competitorn/a
Meas. Tech.ChEMBL_745920 (CHEMBL1776290)
Ki 90±n/a nM
Citation Radi, MDreassi, EBrullo, CCrespan, ETintori, CBernardo, VValoti, MZamperini, CDaigl, HMusumeci, FCarraro, FNaldini, AFilippi, IMaga, GSchenone, SBotta, M Design, synthesis, biological activity, and ADME properties of pyrazolo[3,4-d]pyrimidines active in hypoxic human leukemia cells: a lead optimization study. J Med Chem54:2610-26 (2011) 
 
Tyrosine-protein kinase ABL1
Name:Tyrosine-protein kinase ABL1
Type:Enzyme
Mol. Mass.:122897.30
Organism:Homo sapiens (Human)
Description:P00519
Residue:1130
BDBM50343427
NameBDBM50343427
Synonyms:CHEMBL1775039 | N-Benzyl-1-(2-chloro-2-phenylethyl)-6-[(2-morpholin-4-ylethyl)-thio]-1H-pyrazolo[3,4-d]pyrimidin-4-amine
TypeSmall organic molecule
Emp. Form.C26H29ClN6OS
Mol. Mass.509.066
SMILESClC(Cn1ncc2c(NCc3ccccc3)nc(SCCN3CCOCC3)nc12)c1ccccc1