Reaction Details
TargetTyrosine-protein kinase ABL1
LigandBDBM50343428
Substrate/Competitorn/a
Meas. Tech.ChEMBL_745920 (CHEMBL1776290)
Ki 580±n/a nM
Citation Radi, MDreassi, EBrullo, CCrespan, ETintori, CBernardo, VValoti, MZamperini, CDaigl, HMusumeci, FCarraro, FNaldini, AFilippi, IMaga, GSchenone, SBotta, M Design, synthesis, biological activity, and ADME properties of pyrazolo[3,4-d]pyrimidines active in hypoxic human leukemia cells: a lead optimization study. J Med Chem54:2610-26 (2011) 
 
Tyrosine-protein kinase ABL1
Name:Tyrosine-protein kinase ABL1
Type:Enzyme
Mol. Mass.:122897.30
Organism:Homo sapiens (Human)
Description:P00519
Residue:1130
BDBM50343428
NameBDBM50343428
Synonyms:1-(2-Chloro-2-phenylethyl)-N-(4-fluorobenzyl)-6-[(2-morpholin-4-ylethyl)thio]-1H-pyrazolo[3,4-d]pyrimidin-4-amine | CHEMBL1775038
TypeSmall organic molecule
Emp. Form.C26H28ClFN6OS
Mol. Mass.527.057
SMILESFc1ccc(CNc2nc(SCCN3CCOCC3)nc3n(CC(Cl)c4ccccc4)ncc23)cc1