Reaction Details
TargetProto-oncogene tyrosine-protein kinase Src
LigandBDBM50343430
Substrate/Competitorn/a
Meas. Tech.ChEMBL_745919 (CHEMBL1776289)
Ki 190±n/a nM
Citation Radi, MDreassi, EBrullo, CCrespan, ETintori, CBernardo, VValoti, MZamperini, CDaigl, HMusumeci, FCarraro, FNaldini, AFilippi, IMaga, GSchenone, SBotta, M Design, synthesis, biological activity, and ADME properties of pyrazolo[3,4-d]pyrimidines active in hypoxic human leukemia cells: a lead optimization study. J Med Chem54:2610-26 (2011) 
 
Proto-oncogene tyrosine-protein kinase Src
Name:Proto-oncogene tyrosine-protein kinase Src
Type:Protein
Mol. Mass.:59838.60
Organism:Homo sapiens (Human)
Description:P12931
Residue:536
BDBM50343430
NameBDBM50343430
Synonyms:CHEMBL1775036 | N-(3-Chlorophenyl)-1-(2-chloro-2-phenylethyl)-6-[(2-morpholin-4-ylethyl)thio]-1H-pyrazolo[3,4-d]pyrimidin-4-amine
TypeSmall organic molecule
Emp. Form.C25H26Cl2N6OS
Mol. Mass.529.485
SMILESClC(Cn1ncc2c(Nc3cccc(Cl)c3)nc(SCCN3CCOCC3)nc12)c1ccccc1