Reaction Details
TargetE3 ubiquitin-protein ligase XIAP
LigandBDBM50343521
Substrate/Competitorn/a
Meas. Tech.ChEMBL_746784 (CHEMBL1776953)
Ki 1.5±n/a nM
Citation Sun, HLiu, LLu, JBai, LLi, XNikolovska-Coleska, ZMcEachern, DYang, CYQiu, SYi, HSun, DWang, S Potent bivalent Smac mimetics: effect of the linker on binding to inhibitor of apoptosis proteins (IAPs) and anticancer activity. J Med Chem54:3306-18 (2011) 
 
E3 ubiquitin-protein ligase XIAP
Name:E3 ubiquitin-protein ligase XIAP
Type:Protein
Mol. Mass.:56685.27
Organism:Homo sapiens (Human)
Description:P98170
Residue:497
BDBM50343521
NameBDBM50343521
Synonyms:(S,3S,3'S,6S,6'S,1'aS,1'a'S)-N,N'-((1S,1'S)-(1,1'-(1,4-Phenylenebis-(propane-3,1-diyl))bis(1H-1,2,3-triazole-4,1-diyl))bis(phenylmethylene))bis(6-((S)-2-(methylamino)propanamido)-5-oxodecahydropyrrolo[1,2-a]azocine-3-carboxamide) | CHEMBL1774157
TypeSmall organic molecule
Emp. Form.C60H80N14O6
Mol. Mass.1093.3674
SMILESCN[C@@H](C)C(=O)N[C@H]1CCCC[C@H]2CC[C@H](N2C1=O)C(=O)N[C@H](c1cn(CCCc2ccc(CCCn3cc(nn3)[C@@H](NC(=O)[C@@H]3CC[C@@H]4CCCC[C@H](NC(=O)[C@H](C)NC)C(=O)N34)c3ccccc3)cc2)nn1)c1ccccc1