Reaction Details
TargetBaculoviral IAP repeat-containing protein 2
LigandBDBM50343515
Substrate/Competitorn/a
Meas. Tech.ChEMBL_746785 (CHEMBL1777015)
IC50 6.2±n/a nM
Citation Sun, HLiu, LLu, JBai, LLi, XNikolovska-Coleska, ZMcEachern, DYang, CYQiu, SYi, HSun, DWang, S Potent bivalent Smac mimetics: effect of the linker on binding to inhibitor of apoptosis proteins (IAPs) and anticancer activity. J Med Chem54:3306-18 (2011) 
 
Baculoviral IAP repeat-containing protein 2
Name:Baculoviral IAP repeat-containing protein 2
Type:Protein
Mol. Mass.:69900.47
Organism:Homo sapiens (Human)
Description:Q13490
Residue:618
BDBM50343515
NameBDBM50343515
Synonyms:(3S,6S,1'aS)-6-((S)-2-(Methylamino)propanamido)-N-((1-(4-(4-(4-(4-((S)-((3S,6S,1'aS)-6-((S)-2-(methylamino)propanamido)-5-oxodecahydropyrrolo[1,2-a]azocine-3-carboxamido)(phenyl)methyl)-1H-1,2,3-triazol-1-yl)butyl)-1H-1,2,3-triazol-1-yl)butyl)1H-1,2,3-triazol-4-yl)-(phenyl)methyl)-5-oxodecahydropyrrolo[1,2-a]azocine-3-carboxamide | CHEMBL1774161
TypeSmall organic molecule
Emp. Form.C58H81N17O6
Mol. Mass.1112.374
SMILESCN[C@@H](C)C(=O)N[C@H]1CCCC[C@H]2CC[C@H](N2C1=O)C(=O)N[C@H](c1cn(CCCCc2cn(CCCCn3cc(nn3)[C@@H](NC(=O)[C@@H]3CC[C@@H]4CCCC[C@H](NC(=O)[C@H](C)NC)C(=O)N34)c3ccccc3)nn2)nn1)c1ccccc1