Reaction Details
TargetBaculoviral IAP repeat-containing protein 3
LigandBDBM50343524
Substrate/Competitorn/a
Meas. Tech.ChEMBL_746856 (CHEMBL1777139)
IC50 8.7±n/a nM
Citation Sun, HLiu, LLu, JBai, LLi, XNikolovska-Coleska, ZMcEachern, DYang, CYQiu, SYi, HSun, DWang, S Potent bivalent Smac mimetics: effect of the linker on binding to inhibitor of apoptosis proteins (IAPs) and anticancer activity. J Med Chem54:3306-18 (2011) 
 
Baculoviral IAP repeat-containing protein 3
Name:Baculoviral IAP repeat-containing protein 3
Type:Protein
Mol. Mass.:68365.75
Organism:Homo sapiens (Human)
Description:Q13489
Residue:604
BDBM50343524
NameBDBM50343524
Synonyms:(S,3S,3'S,6S,6'S,1'aS,1'a'S)-N,N'-((1S,1'S)-(1,1'-(Dodecane-1,12-diyl)bis-(1H-1,2,3-triazole-4,1-diyl))bis(phenylmethylene))bis(6-((S)-2-(methylamino)propanamido)-5-oxodecahydropyrrolo[1,2-a]azocine-3-carboxamide) | CHEMBL1774160
TypeSmall organic molecule
Emp. Form.C60H88N14O6
Mol. Mass.1101.4309
SMILESCN[C@@H](C)C(=O)N[C@H]1CCCC[C@H]2CC[C@H](N2C1=O)C(=O)N[C@H](c1cn(CCCCCCCCCCCCn2cc(nn2)[C@@H](NC(=O)[C@@H]2CC[C@@H]3CCCC[C@H](NC(=O)[C@H](C)NC)C(=O)N23)c2ccccc2)nn1)c1ccccc1