Reaction Details
TargetProstaglandin E synthase
LigandBDBM50270591
Substrate/Competitorn/a
Meas. Tech.ChEMBL_746975 (CHEMBL1777341)
IC50 0.7±n/a nM
Citation Waltenberger, BWiechmann, KBauer, JMarkt, PNoha, SMWolber, GRollinger, JMWerz, OSchuster, DStuppner, H Pharmacophore modeling and virtual screening for novel acidic inhibitors of microsomal prostaglandin E2 synthase-1 (mPGES-1). J Med Chem54:3163-74 (2011) 
 
Prostaglandin E synthase
Name:Prostaglandin E synthase
Type:Protein
Mol. Mass.:17112.22
Organism:Homo sapiens (Human)
Description:n/a
Residue:152
BDBM50270591
NameBDBM50270591
Synonyms:2-(6-chloro-9-(3-hydroxy-3-methylbutyl)-1H-phenanthro[9,10-d]imidazol-2-yl)isophthalonitrile | CHEMBL482674
TypeSmall organic molecule
Emp. Form.C28H21ClN4O
Mol. Mass.464.946
SMILESCC(C)(O)CCc1ccc2c3[nH]c(nc3c3ccc(Cl)cc3c2c1)-c1c(cccc1C#N)C#N