Reaction Details
TargetProstaglandin E synthase
LigandBDBM50270594
Substrate/Competitorn/a
Meas. Tech.ChEMBL_746975 (CHEMBL1777341)
IC50 390±n/a nM
Citation Waltenberger, BWiechmann, KBauer, JMarkt, PNoha, SMWolber, GRollinger, JMWerz, OSchuster, DStuppner, H Pharmacophore modeling and virtual screening for novel acidic inhibitors of microsomal prostaglandin E2 synthase-1 (mPGES-1). J Med Chem54:3163-74 (2011) 
 
Prostaglandin E synthase
Name:Prostaglandin E synthase
Type:Protein
Mol. Mass.:17112.22
Organism:Homo sapiens (Human)
Description:n/a
Residue:152
BDBM50270594
NameBDBM50270594
Synonyms:4-(3-chlorobenzyl)-2,6-bis(4-(trifluoromethoxy)phenyl)-4H-thieno[3,2-b]pyrrole-5-carboxylic acid | CHEMBL507979
TypeSmall organic molecule
Emp. Form.C28H16ClF6NO4S
Mol. Mass.611.939
SMILESOC(=O)c1c(-c2ccc(OC(F)(F)F)cc2)c2sc(cc2n1Cc1cccc(Cl)c1)-c1ccc(OC(F)(F)F)cc1