Reaction Details
TargetMatrix protein 2 [1-96]
LigandBDBM50343550
Substrate/Competitorn/a
Meas. Tech.ChEMBL_747076 (CHEMBL1777442)
IC50 24000±n/a nM
Citation Duque, MDMa, CTorres, EWang, JNaesens, LJuárez-Jiménez, JCamps, PLuque, FJDeGrado, WFLamb, RAPinto, LHVázquez, S Exploring the size limit of templates for inhibitors of the M2 ion channel of influenza A virus. J Med Chem54:2646-57 (2011) 
 
Matrix protein 2 [1-96]
Name:Matrix protein 2 [1-96]
Type:PROTEIN
Mol. Mass.:11051.96
Organism:Influenza A virus
Description:ChEMBL_1453980
Residue:96
BDBM50343550
NameBDBM50343550
Synonyms:3-Azaoctacyclo[8.7.0.0(1,5).0(5,13).0(6,11).0(7,9).0(12,17).0(14,16)]heptadecane Hydrochloride | CHEMBL1774321
TypeSmall organic molecule
Emp. Form.C16H19N
Mol. Mass.225.3288
SMILESC1C2C1C1C3C2C24CNCC12C1C2CC2C4C31