Reaction Details
TargetReplicase polyprotein 1ab
LigandBDBM53105
Substrate/Competitorn/a
Meas. Tech.ChEMBL_747144 (CHEMBL1777510)
Ki 9930±n/a nM
Citation Nguyen, TTRyu, HJLee, SHHwang, SBreton, VRhee, JHKim, D Virtual screening identification of novel severe acute respiratory syndrome 3C-like protease inhibitors and in vitro confirmation. Bioorg Med Chem Lett21:3088-91 (2011) 
 
Replicase polyprotein 1ab
Name:Replicase polyprotein 1ab
Type:Protein
Mol. Mass.:790250.81
Organism:Human SARS coronavirus (SARS-CoV) (Severe acute respiratory syndrome coronavirus)
Description:P0C6X7
Residue:7073
BDBM53105
NameBDBM53105
Synonyms:CHEMBL1315054 N-[(Z)-1-[3-(dimethylamino)propylcarbamoyl]-2-[5-(2-nitrophenyl)-2-furyl]vinyl]-4-methyl-benzamide N-[(Z)-3-[3-(dimethylamino)propylamino]-1-[5-(2-nitrophenyl)furan-2-yl]-3-oxidanylidene-prop-1-en-2-yl]-4-methyl-benzamide N-{1-({[3-(dimethylamino)propyl]amino}carbonyl)-2-[5-(2-nitrophenyl)-2-furyl]vinyl}-4-methylbenzamide cid_2131982 | jm5b01461, Compound 187
TypeSmall organic molecule
Emp. Form.C26H28N4O5
Mol. Mass.476.5243
SMILESCN(C)CCCNC(=O)C(\NC(=O)c1ccc(C)cc1)=C\c1ccc(o1)-c1ccccc1[N+]([O-])=O