Reaction Details
TargetSerine/threonine-protein kinase PLK2
LigandBDBM50343563
Substrate/Competitorn/a
Meas. Tech.ChEMBL_747146 (CHEMBL1777512)
IC50>10000±n/a nM
Citation Beria, IBossi, RTBrasca, MGCaruso, MCeccarelli, WFachin, GFasolini, MForte, BFiorentini, FPesenti, EPezzetta, DPosteri, HScolaro, ARe Depaolini, SValsasina, B NMS-P937, a 4,5-dihydro-1H-pyrazolo[4,3-h]quinazoline derivative as potent and selective Polo-like kinase 1 inhibitor. Bioorg Med Chem Lett21:2969-74 (2011) 
 
Serine/threonine-protein kinase PLK2
Name:Serine/threonine-protein kinase PLK2
Type:Serine/threonine-protein kinase
Mol. Mass.:78259.87
Organism:Homo sapiens (Human)
Description:Full-length human PLK2 was expressed as GST-fusion protein using baculovirus expression system. GST-PLK2 was purified by using glutathione sepharose chromatography.
Residue:685
BDBM50343563
NameBDBM50343563
Synonyms:1-(3-(dimethylamino)propyl)-8-(5-(4-methylpiperazin-1-yl)-2-(trifluoromethoxy)phenylamino)-4,5-dihydro-1H-pyrazolo[4,3-h]quinazoline-3-carboxamide | CHEMBL1774340
TypeSmall organic molecule
Emp. Form.C27H34F3N9O2
Mol. Mass.573.6132
SMILESCN(C)CCCn1nc(C(N)=O)c2CCc3cnc(Nc4cc(ccc4OC(F)(F)F)N4CCN(C)CC4)nc3-c12