Reaction Details
TargetMitotic checkpoint serine/threonine-protein kinase BUB1
LigandBDBM50343559
Substrate/Competitorn/a
Meas. Tech.ChEMBL_747258 (CHEMBL1776517)
IC50>10000±n/a nM
Citation Beria, IBossi, RTBrasca, MGCaruso, MCeccarelli, WFachin, GFasolini, MForte, BFiorentini, FPesenti, EPezzetta, DPosteri, HScolaro, ARe Depaolini, SValsasina, B NMS-P937, a 4,5-dihydro-1H-pyrazolo[4,3-h]quinazoline derivative as potent and selective Polo-like kinase 1 inhibitor. Bioorg Med Chem Lett21:2969-74 (2011) 
 
Mitotic checkpoint serine/threonine-protein kinase BUB1
Name:Mitotic checkpoint serine/threonine-protein kinase BUB1
Type:PROTEIN
Mol. Mass.:122372.31
Organism:Homo sapiens (Human)
Description:ChEMBL_1510603
Residue:1085
BDBM50343559
NameBDBM50343559
Synonyms:1-(2-HYDROXYETHYL)-8-[[5-(4-METHYLPIPERAZIN-1-YL)-2-(TRIFLUOROMETHOXY)PHENYL]AMINO]-4,5-DIHYDROPYRIMIDO[5,4-G]INDAZOLE-3-CARBOXAMIDE CHEMBL1738758
TypeSmall organic molecule
Emp. Form.C24H27F3N8O3
Mol. Mass.532.5182
SMILESCN1CCN(CC1)c1ccc(OC(F)(F)F)c(Nc2ncc3CCc4c(nn(CCO)c4-c3n2)C(N)=O)c1