Reaction Details
TargetSerine/threonine-protein kinase PLK3
LigandBDBM50343566
Substrate/Competitorn/a
Meas. Tech.ChEMBL_747147 (CHEMBL1777513)
IC50 713±n/a nM
Citation Beria, IBossi, RTBrasca, MGCaruso, MCeccarelli, WFachin, GFasolini, MForte, BFiorentini, FPesenti, EPezzetta, DPosteri, HScolaro, ARe Depaolini, SValsasina, B NMS-P937, a 4,5-dihydro-1H-pyrazolo[4,3-h]quinazoline derivative as potent and selective Polo-like kinase 1 inhibitor. Bioorg Med Chem Lett21:2969-74 (2011) 
 
Serine/threonine-protein kinase PLK3
Name:Serine/threonine-protein kinase PLK3
Type:Serine/threonine-protein kinase
Mol. Mass.:71655.17
Organism:Homo sapiens (Human)
Description:Enzyme assays were using PLK3 purified from baculovirus-infected Trichoplusia ni cells expressing full-length PLK3.
Residue:646
BDBM50343566
NameBDBM50343566
Synonyms:1-methyl-8-(5-(3-(4-methylpiperazin-1-yl)propylamino)-2-(trifluoromethoxy)phenylamino)-4,5-dihydro-1H-pyrazolo[4,3-h]quinazoline-3-carboxamide | CHEMBL1774333
TypeSmall organic molecule
Emp. Form.C26H32F3N9O2
Mol. Mass.559.5866
SMILESCN1CCN(CCCNc2ccc(OC(F)(F)F)c(Nc3ncc4CCc5c(nn(C)c5-c4n3)C(N)=O)c2)CC1