Reaction Details
TargetHistamine H1 receptor
LigandBDBM50343573
Substrate/Competitorn/a
Meas. Tech.ChEMBL_745951 (CHEMBL1775250)
IC50 530±n/a nM
Citation Kubota, KKurebayashi, HMiyachi, HTobe, MOnishi, MIsobe, Y Synthesis and structure-activity relationship of tricyclic carboxylic acids as novel anti-histamines. Bioorg Med Chem19:3005-21 (2011) 
 
Histamine H1 receptor
Name:Histamine H1 receptor
Type:G Protein-Coupled Receptor (GPCR)
Mol. Mass.:55808.72
Organism:Homo sapiens (Human)
Description:Cell pellets from SK-N-MC cells transfected with human H1 receptor were used in binding assay.
Residue:487
BDBM50343573
NameBDBM50343573
Synonyms:5-(3-(4-(1,3-Dimethyl-2,6-dioxo-1,2,3,6-tetrahydropyrimidin-4-yl)-1,4-diazepan-1-yl)propyl)-5,11-dihydrodibenzo[b,e][1,4]oxazepine-3-carboxylic acid | CHEMBL1774496
TypeSmall organic molecule
Emp. Form.C28H33N5O5
Mol. Mass.519.5921
SMILESCn1c(cc(=O)n(C)c1=O)N1CCCN(CCCN2c3cc(ccc3COc3ccccc23)C(O)=O)CC1