Reaction Details
TargetHistamine H1 receptor
LigandBDBM50343584
Substrate/Competitorn/a
Meas. Tech.ChEMBL_745951 (CHEMBL1775250)
IC50 325±n/a nM
Citation Kubota, KKurebayashi, HMiyachi, HTobe, MOnishi, MIsobe, Y Synthesis and structure-activity relationship of tricyclic carboxylic acids as novel anti-histamines. Bioorg Med Chem19:3005-21 (2011) 
 
Histamine H1 receptor
Name:Histamine H1 receptor
Type:G Protein-Coupled Receptor (GPCR)
Mol. Mass.:55808.72
Organism:Homo sapiens (Human)
Description:Cell pellets from SK-N-MC cells transfected with human H1 receptor were used in binding assay.
Residue:487
BDBM50343584
NameBDBM50343584
Synonyms:(Z)-11-(3-(4-(1,3-Dimethyl-2,6-dioxo-1,2,3,6-tetrahydropyrimidin-4-yl)piperazin-1-yl)propylidene)-6,11-dihydrodibenzo[b,e]oxepine-2-carboxylic acid | CHEMBL1774503
TypeSmall organic molecule
Emp. Form.C28H30N4O5
Mol. Mass.502.5616
SMILESCn1c(cc(=O)n(C)c1=O)N1CCN(CC\C=C2\c3ccccc3COc3ccc(cc23)C(O)=O)CC1