Reaction Details
TargetHistamine H1 receptor
LigandBDBM50343588
Substrate/Competitorn/a
Meas. Tech.ChEMBL_745951 (CHEMBL1775250)
IC50 75±n/a nM
Citation Kubota, KKurebayashi, HMiyachi, HTobe, MOnishi, MIsobe, Y Synthesis and structure-activity relationship of tricyclic carboxylic acids as novel anti-histamines. Bioorg Med Chem19:3005-21 (2011) 
 
Histamine H1 receptor
Name:Histamine H1 receptor
Type:G Protein-Coupled Receptor (GPCR)
Mol. Mass.:55808.72
Organism:Homo sapiens (Human)
Description:Cell pellets from SK-N-MC cells transfected with human H1 receptor were used in binding assay.
Residue:487
BDBM50343588
NameBDBM50343588
Synonyms:2-(5-(3-(4-(1,3-Dimethyl-2,6-dioxo-1,2,3,6-tetrahydropyrimidin-4-yl)-1,4-diazepan-1-yl)propyl)-10,11-dihydro-5Hdibenzo[b,f]azepin-3-yl)-2-methylpropanoic acid | CHEMBL1774499
TypeSmall organic molecule
Emp. Form.C32H41N5O4
Mol. Mass.559.699
SMILESCn1c(cc(=O)n(C)c1=O)N1CCCN(CCCN2c3ccccc3CCc3ccc(cc23)C(C)(C)C(O)=O)CC1