Reaction Details
TargetMelatonin receptor type 1B
LigandBDBM50343608
Substrate/Competitorn/a
Meas. Tech.ChEMBL_746050 (CHEMBL1775437)
Ki 0.018±n/a nM
Citation Koike, THoashi, YTakai, TNakayama, MYukuhiro, NIshikawa, THirai, KUchikawa, O 1,6-Dihydro-2H-indeno[5,4-b]furan derivatives: design, synthesis, and pharmacological characterization of a novel class of highly potent MT2-selective agonists. J Med Chem54:3436-44 (2011) 
 
Melatonin receptor type 1B
Name:Melatonin receptor type 1B
Type:Enzyme
Mol. Mass.:40203.54
Organism:Homo sapiens (Human)
Description:P49286
Residue:362
BDBM50343608
NameBDBM50343608
Synonyms:CHEMBL1774513 | N-[2-(7-Isopropyl-1,6-dihydro-2H-indeno[5,4-b]furan-8-yl)-ethyl]acetamide
TypeSmall organic molecule
Emp. Form.C18H23NO2
Mol. Mass.285.3807
SMILESCC(C)C1=C(CCNC(C)=O)c2c(C1)ccc1OCCc21