Reaction Details
TargetMelatonin receptor type 1A
LigandBDBM50343604
Substrate/Competitorn/a
Meas. Tech.ChEMBL_746047 (CHEMBL1775434)
Ki 1.1±n/a nM
Citation Koike, THoashi, YTakai, TNakayama, MYukuhiro, NIshikawa, THirai, KUchikawa, O 1,6-Dihydro-2H-indeno[5,4-b]furan derivatives: design, synthesis, and pharmacological characterization of a novel class of highly potent MT2-selective agonists. J Med Chem54:3436-44 (2011) 
 
Melatonin receptor type 1A
Name:Melatonin receptor type 1A
Type:Enzyme
Mol. Mass.:39392.94
Organism:Homo sapiens (Human)
Description:P48039
Residue:350
BDBM50343604
NameBDBM50343604
Synonyms:CHEMBL1774517 | N-Ethyl-N'-[2-(7-isopropyl-1,6-dihydro-2H-indeno[5,4-b]-furan-8-yl)ethyl]urea
TypeSmall organic molecule
Emp. Form.C19H26N2O2
Mol. Mass.314.4219
SMILESCCNC(=O)NCCC1=C(Cc2ccc3OCCc3c12)C(C)C