Reaction Details
TargetSigma non-opioid intracellular receptor 1
LigandBDBM50343620
Substrate/Competitorn/a
Meas. Tech.ChEMBL_746382 (CHEMBL1776341)
Ki 0.8±n/a nM
Citation Li, ZJRen, HYCui, MCDeuther-Conrad, WTang, RKSteinbach, JBrust, PLiu, BLJia, HM Synthesis and biological evaluation of novel 4-benzylpiperazine ligands for sigma-1 receptor imaging. Bioorg Med Chem19:2911-7 (2011) 
 
Sigma non-opioid intracellular receptor 1
Name:Sigma non-opioid intracellular receptor 1
Type:Enzyme Catalytic Domain
Mol. Mass.:25266.54
Organism:RAT
Description:Q9R0C9
Residue:223
BDBM50343620
NameBDBM50343620
Synonyms:1-(1,3-Benzodioxol-5-ylmethyl)-4-(4-iodobenzyl)piperazine | CHEMBL1774730
TypeSmall organic molecule
Emp. Form.C19H21IN2O2
Mol. Mass.436.2867
SMILESIc1ccc(CN2CCN(Cc3ccc4OCOc4c3)CC2)cc1