Reaction Details
TargetMu-type opioid receptor
LigandBDBM50343627
Substrate/Competitorn/a
Meas. Tech.ChEMBL_746793 (CHEMBL1777023)
IC50 7.6±n/a nM
Citation Zhang, BZhang, TSromek, AWScrimale, TBidlack, JMNeumeyer, JL Synthesis and binding affinity of novel mono- and bivalent morphinan ligands for κ, μ, and δ opioid receptors. Bioorg Med Chem19:2808-16 (2011) 
 
Mu-type opioid receptor
Name:Mu-type opioid receptor
Type:G Protein-Coupled Receptor (GPCR)
Mol. Mass.:44789.51
Organism:Homo sapiens (Human)
Description:P35372
Residue:400
BDBM50343627
NameBDBM50343627
Synonyms:Benzyl-(-)-14-methoxy-butorphanol-3-yl-decanedioate | CHEMBL1773091
TypeSmall organic molecule
Emp. Form.C39H53NO5
Mol. Mass.615.8418
SMILESCO[C@@]12CCCC[C@@]11CCN(CC3CCC3)[C@@H]2Cc2ccc(OC(=O)CCCCCCCCC(=O)OCc3ccccc3)cc12