Reaction Details
TargetMu-type opioid receptor
LigandBDBM50343630
Substrate/Competitorn/a
Meas. Tech.ChEMBL_746702 (CHEMBL1776827)
Ki 8.8±n/a nM
Citation Zhang, BZhang, TSromek, AWScrimale, TBidlack, JMNeumeyer, JL Synthesis and binding affinity of novel mono- and bivalent morphinan ligands for κ, μ, and δ opioid receptors. Bioorg Med Chem19:2808-16 (2011) 
 
Mu-type opioid receptor
Name:Mu-type opioid receptor
Type:G Protein-Coupled Receptor (GPCR)
Mol. Mass.:44789.51
Organism:Homo sapiens (Human)
Description:P35372
Residue:400
BDBM50343630
NameBDBM50343630
Synonyms:Bis((-)-3-aminothiazolo-N-cyclopropylmethylmorphinan)sebacamide | CHEMBL1774951
TypeSmall organic molecule
Emp. Form.C52H68N6O2S2
Mol. Mass.873.265
SMILESO=C(CCCCCCCCC(=O)Nc1nc2cc3c(C[C@@H]4[C@@H]5CCCC[C@]35CCN4CC3CC3)cc2s1)Nc1nc2cc3c(C[C@@H]4[C@@H]5CCCC[C@]35CCN4CC3CC3)cc2s1