Reaction Details
TargetMu-type opioid receptor
LigandBDBM50343628
Substrate/Competitorn/a
Meas. Tech.ChEMBL_746793 (CHEMBL1777023)
IC50 260±n/a nM
Citation Zhang, BZhang, TSromek, AWScrimale, TBidlack, JMNeumeyer, JL Synthesis and binding affinity of novel mono- and bivalent morphinan ligands for κ, μ, and δ opioid receptors. Bioorg Med Chem19:2808-16 (2011) 
 
Mu-type opioid receptor
Name:Mu-type opioid receptor
Type:G Protein-Coupled Receptor (GPCR)
Mol. Mass.:44789.51
Organism:Homo sapiens (Human)
Description:P35372
Residue:400
BDBM50343628
NameBDBM50343628
Synonyms:Bis((-)-14-methoxy-17-N-cyclobutylmethyl)morphinan-3-yl-decanedioate | CHEMBL1774947
TypeSmall organic molecule
Emp. Form.C54H76N2O6
Mol. Mass.849.191
SMILESCO[C@@]12CCCC[C@@]11CCN(CC3CCC3)[C@@H]2Cc2ccc(OC(=O)CCCCCCCCC(=O)Oc3ccc4C[C@H]5N(CC6CCC6)CC[C@@]6(CCCC[C@@]56OC)c4c3)cc12