Reaction Details
TargetKappa-type opioid receptor
LigandBDBM50343624
Substrate/Competitorn/a
Meas. Tech.ChEMBL_746790 (CHEMBL1777020)
EC50 12±n/a nM
Citation Zhang, BZhang, TSromek, AWScrimale, TBidlack, JMNeumeyer, JL Synthesis and binding affinity of novel mono- and bivalent morphinan ligands for κ, μ, and δ opioid receptors. Bioorg Med Chem19:2808-16 (2011) 
 
Kappa-type opioid receptor
Name:Kappa-type opioid receptor
Type:G Protein-Coupled Receptor (GPCR)
Mol. Mass.:42648.76
Organism:Homo sapiens (Human)
Description:P41145
Residue:380
BDBM50343624
NameBDBM50343624
Synonyms:5alpha-17-Allyl-14-hydroxy-6-oxo-4,5-epoxymorphinan-3-yl-17-((-)-N-cyclobutylmethyl-14-hydroxyl-mophinan-3-yl)decanedioate | CHEMBL1774950
TypeSmall organic molecule
Emp. Form.C50H64N2O8
Mol. Mass.821.0518
SMILESO[C@]12CCC(=O)[C@@H]3Oc4c5c(C[C@H]1N(CC=C)CC[C@@]235)ccc4OC(=O)CCCCCCCCC(=O)Oc1ccc2C[C@H]3N(CC4CCC4)CC[C@@]4(CCCC[C@@]34O)c2c1