Reaction Details
TargetKappa-type opioid receptor
LigandBDBM50343629
Substrate/Competitorn/a
Meas. Tech.ChEMBL_746790 (CHEMBL1777020)
EC50 2.8±n/a nM
Citation Zhang, BZhang, TSromek, AWScrimale, TBidlack, JMNeumeyer, JL Synthesis and binding affinity of novel mono- and bivalent morphinan ligands for κ, μ, and δ opioid receptors. Bioorg Med Chem19:2808-16 (2011) 
 
Kappa-type opioid receptor
Name:Kappa-type opioid receptor
Type:G Protein-Coupled Receptor (GPCR)
Mol. Mass.:42648.76
Organism:Homo sapiens (Human)
Description:P41145
Residue:380
BDBM50343629
NameBDBM50343629
Synonyms:(-)-14-Methoxybutorphanol | CHEMBL1774946
TypeSmall organic molecule
Emp. Form.C22H31NO2
Mol. Mass.341.487
SMILESCO[C@@]12CCCC[C@@]11CCN(CC3CCC3)[C@@H]2Cc2ccc(O)cc12