Reaction Details
TargetKappa-type opioid receptor
LigandBDBM50135806
Substrate/Competitorn/a
Meas. Tech.ChEMBL_746791 (CHEMBL1777021)
Ki 0.049000±n/a nM
Citation Zhang, BZhang, TSromek, AWScrimale, TBidlack, JMNeumeyer, JL Synthesis and binding affinity of novel mono- and bivalent morphinan ligands for κ, μ, and δ opioid receptors. Bioorg Med Chem19:2808-16 (2011) 
 
Kappa-type opioid receptor
Name:Kappa-type opioid receptor
Type:G Protein-Coupled Receptor (GPCR)
Mol. Mass.:42648.76
Organism:Homo sapiens (Human)
Description:P41145
Residue:380
BDBM50135806
NameBDBM50135806
Synonyms:CHEMBL147511 di[17-cyclobutylmethyl-(1R,9R,10R)-17-azatetracyclo[7.5.3.01,10.02,7]heptadeca-2(7),3,5-trien-4-yl] sebacate
TypeSmall organic molecule
Emp. Form.C52H72N2O4
Mol. Mass.789.1391
SMILESO=C(CCCCCCCCC(=O)Oc1ccc2C[C@@H]3[C@@H]4CCCC[C@]4(CCN3CC3CCC3)c2c1)Oc1ccc2C[C@@H]3[C@@H]4CCCC[C@]4(CCN3CC3CCC3)c2c1