Reaction Details
TargetMu-type opioid receptor
LigandBDBM50210557
Substrate/Competitorn/a
Meas. Tech.ChEMBL_746793 (CHEMBL1777023)
Ki 1.5±n/a nM
Citation Zhang, BZhang, TSromek, AWScrimale, TBidlack, JMNeumeyer, JL Synthesis and binding affinity of novel mono- and bivalent morphinan ligands for κ, μ, and δ opioid receptors. Bioorg Med Chem19:2808-16 (2011) 
 
Mu-type opioid receptor
Name:Mu-type opioid receptor
Type:G Protein-Coupled Receptor (GPCR)
Mol. Mass.:44789.51
Organism:Homo sapiens (Human)
Description:P35372
Residue:400
BDBM50210557
NameBDBM50210557
Synonyms:CHEMBL242756 | MCL-147
TypeSmall organic molecule
Emp. Form.C21H27N3S
Mol. Mass.353.524
SMILESNc1nc2cc3c(C[C@@H]4[C@@H]5CCCC[C@]35CCN4CC3CC3)cc2s1