Reaction Details
TargetMu-type opioid receptor
LigandBDBM50240437
Substrate/Competitorn/a
Meas. Tech.ChEMBL_746793 (CHEMBL1777023)
Ki 0.220000±n/a nM
Citation Zhang, BZhang, TSromek, AWScrimale, TBidlack, JMNeumeyer, JL Synthesis and binding affinity of novel mono- and bivalent morphinan ligands for κ, μ, and δ opioid receptors. Bioorg Med Chem19:2808-16 (2011) 
 
Mu-type opioid receptor
Name:Mu-type opioid receptor
Type:G Protein-Coupled Receptor (GPCR)
Mol. Mass.:44789.51
Organism:Homo sapiens (Human)
Description:P35372
Residue:400
BDBM50240437
NameBDBM50240437
Synonyms:(-)-17-(cyclobutylmethyl)morphinan-3,14-diol (-)-butorphanol BUTORPHANOL US10231963, Table B.3 US11534436, Compound Table B.3 | US9656961, Example 00120
TypeSmall organic molecule
Emp. Form.C21H29NO2
Mol. Mass.327.4605
SMILESOc1ccc2C[C@H]3N(CC4CCC4)CC[C@@]4(CCCC[C@@]34O)c2c1