Reaction Details
TargetMelanocortin receptor 3
LigandBDBM50184359
Substrate/Competitorn/a
Meas. Tech.ChEMBL_747179 (CHEMBL1777642)
IC50 8±n/a nM
Citation Mayorov, AVCai, MPalmer, ESTanaka, DKCain, JPDedek, MMTan, BTrivedi, DHruby, VJ Cyclic lactam hybrida-MSH/Agouti-related protein (AGRP) analogues with nanomolar range binding affinities at the human melanocortin receptors. Bioorg Med Chem Lett21:3099-102 (2011) 
 
Melanocortin receptor 3
Name:Melanocortin receptor 3
Type:Enzyme
Mol. Mass.:36044.86
Organism:Homo sapiens (Human)
Description:P41968
Residue:323
BDBM50184359
NameBDBM50184359
Synonyms:(3S,6S,9R,12S,15S,23S)-15-((S)-2-acetylamino-hexanoylamino)-9-benzyl-6-(3-guanidino-propyl)-12-(3H-imidazol-4-ylmethyl)-3-(1H-indol-3-ylmethyl)-2,5,8,11,14,17-hexaoxo-1,4,7,10,13,18hexaaza-cyclotricosane-23-carboxylic acid amide Ac-Nle-c[Asp-His-DPhe-Arg-Trp-Lys]-NH2 MT-II | ebi_340792
TypeSmall organic molecule
Emp. Form.C50H69N15O9
Mol. Mass.1024.178
SMILESCCCC[C@H](NC(C)=O)C(=O)N[C@H]1CC(=O)NCCCC[C@H](NC(=O)[C@H](Cc2c[nH]c3ccccc23)NC(=O)[C@H](CCCN=C(N)N)NC(=O)[C@@H](Cc2ccccc2)NC(=O)[C@H](Cc2cnc[nH]2)NC1=O)C(N)=O