Reaction Details
TargetRibosomal protein S6 kinase alpha-3
LigandBDBM50343663
Substrate/Competitorn/a
Meas. Tech.ChEMBL_747182 (CHEMBL1777645)
IC50 13180±n/a nM
Citation Lu, WLiu, XCao, XXue, MLiu, KZhao, ZShen, XJiang, HXu, YHuang, JLi, H SHAFTS: a hybrid approach for 3D molecular similarity calculation. 2. Prospective case study in the discovery of diverse p90 ribosomal S6 protein kinase 2 inhibitors to suppress cell migration. J Med Chem54:3564-74 (2011) 
 
Ribosomal protein S6 kinase alpha-3
Name:Ribosomal protein S6 kinase alpha-3
Type:Serine/threonine-protein kinase
Mol. Mass.:83740.03
Organism:Homo sapiens (Human)
Description:The human RSK2 sequence differed from the Genbank entry NM_004586 at one residue, V45G. The protein was cloned and purified from baculovirus expression system.
Residue:740
BDBM50343663
NameBDBM50343663
Synonyms:2-chloro-N'-(5-(trifluoromethyl)pyridin-2-yl)benzohydrazide | CHEMBL1775078
TypeSmall organic molecule
Emp. Form.C13H9ClF3N3O
Mol. Mass.315.678
SMILESFC(F)(F)c1ccc(NNC(=O)c2ccccc2Cl)nc1