Reaction Details
TargetSialidase-4
LigandBDBM50343685
Substrate/Competitorn/a
Meas. Tech.ChEMBL_745979 (CHEMBL1775278)
IC50>1000000±n/a nM
Citation Albohy, AMohan, SZheng, RBPinto, BMCairo, CW Inhibitor selectivity of a new class of oseltamivir analogs against viral neuraminidase over human neuraminidase enzymes. Bioorg Med Chem19:2817-22 (2011) 
 
Sialidase-4
Name:Sialidase-4
Type:PROTEIN
Mol. Mass.:51579.82
Organism:Homo sapiens (Human)
Description:ChEMBL_960637
Residue:484
BDBM50343685
NameBDBM50343685
Synonyms:(3S,4R,5R)-4-Acetamido-5-(1-ethylpropoxy)-3-[4-(1-hydroxy-1-methylethyl)[1,2,3]triazol-1-yl]cyclohex-1-ene-1-carboxylic Acid CHEMBL1270232
TypeSmall organic molecule
Emp. Form.C19H30N4O5
Mol. Mass.394.4653
SMILESCCC(CC)O[C@@H]1CC(=C[C@@H]([C@H]1NC(C)=O)n1cc(nn1)C(C)(C)O)C(O)=O