Reaction Details
TargetCholecystokinin receptor type A
LigandBDBM50343698
Substrate/Competitorn/a
Meas. Tech.ChEMBL_746073 (CHEMBL1775460)
IC50 25±n/a nM
Citation Wang, LHubert, JALee, SJPan, JQian, SReitman, MLStrack, AMWeingarth, DTMacNeil, DJWeber, AEEdmondson, SD Discovery of pyrimidine carboxamides as potent and selective CCK1 receptor agonists. Bioorg Med Chem Lett21:2911-5 (2011) 
 
Cholecystokinin receptor type A
Name:Cholecystokinin receptor type A
Type:G Protein-Coupled Receptor (GPCR)
Mol. Mass.:47859.34
Organism:Homo sapiens (Human)
Description:Stable expression of human CCK-1 receptors in HEK 293 cells.
Residue:428
BDBM50343698
NameBDBM50343698
Synonyms:(5-(3-ethoxyphenyl)-4-p-tolylpyrimidin-2-yl)(4-(quinolin-3-yl)piperazin-1-yl)methanone | CHEMBL1773886
TypeSmall organic molecule
Emp. Form.C33H31N5O2
Mol. Mass.529.6315
SMILESCCOc1cccc(c1)-c1cnc(nc1-c1ccc(C)cc1)C(=O)N1CCN(CC1)c1cnc2ccccc2c1