Reaction Details
TargetCholecystokinin receptor type A
LigandBDBM50343710
Substrate/Competitorn/a
Meas. Tech.ChEMBL_746073 (CHEMBL1775460)
IC50 1.4±n/a nM
Citation Wang, LHubert, JALee, SJPan, JQian, SReitman, MLStrack, AMWeingarth, DTMacNeil, DJWeber, AEEdmondson, SD Discovery of pyrimidine carboxamides as potent and selective CCK1 receptor agonists. Bioorg Med Chem Lett21:2911-5 (2011) 
 
Cholecystokinin receptor type A
Name:Cholecystokinin receptor type A
Type:G Protein-Coupled Receptor (GPCR)
Mol. Mass.:47859.34
Organism:Homo sapiens (Human)
Description:Stable expression of human CCK-1 receptors in HEK 293 cells.
Residue:428
BDBM50343710
NameBDBM50343710
Synonyms:(4-(2-fluorophenyl)-5-(4-methoxyphenyl)pyrimidin-2-yl)(4-(quinolin-3-yl)piperazin-1-yl)methanone | CHEMBL1774032
TypeSmall organic molecule
Emp. Form.C31H26FN5O2
Mol. Mass.519.5688
SMILESCOc1ccc(cc1)-c1cnc(nc1-c1ccccc1F)C(=O)N1CCN(CC1)c1cnc2ccccc2c1