Reaction Details
TargetCholecystokinin receptor type A
LigandBDBM50343715
Substrate/Competitorn/a
Meas. Tech.ChEMBL_746073 (CHEMBL1775460)
IC50 9.9±n/a nM
Citation Wang, LHubert, JALee, SJPan, JQian, SReitman, MLStrack, AMWeingarth, DTMacNeil, DJWeber, AEEdmondson, SD Discovery of pyrimidine carboxamides as potent and selective CCK1 receptor agonists. Bioorg Med Chem Lett21:2911-5 (2011) 
 
Cholecystokinin receptor type A
Name:Cholecystokinin receptor type A
Type:G Protein-Coupled Receptor (GPCR)
Mol. Mass.:47859.34
Organism:Homo sapiens (Human)
Description:Stable expression of human CCK-1 receptors in HEK 293 cells.
Residue:428
BDBM50343715
NameBDBM50343715
Synonyms:(4-(benzofuran-6-yl)piperazin-1-yl)(5-(4-methoxyphenyl)-4-p-tolylpyrimidin-2-yl)methanone | CHEMBL1774037
TypeSmall organic molecule
Emp. Form.C31H28N4O3
Mol. Mass.504.579
SMILESCOc1ccc(cc1)-c1cnc(nc1-c1ccc(C)cc1)C(=O)N1CCN(CC1)c1ccc2ccoc2c1