Reaction Details
TargetCholecystokinin receptor type A
LigandBDBM50343721
Substrate/Competitorn/a
Meas. Tech.ChEMBL_746073 (CHEMBL1775460)
IC50 0.22±n/a nM
Citation Wang, LHubert, JALee, SJPan, JQian, SReitman, MLStrack, AMWeingarth, DTMacNeil, DJWeber, AEEdmondson, SD Discovery of pyrimidine carboxamides as potent and selective CCK1 receptor agonists. Bioorg Med Chem Lett21:2911-5 (2011) 
 
Cholecystokinin receptor type A
Name:Cholecystokinin receptor type A
Type:G Protein-Coupled Receptor (GPCR)
Mol. Mass.:47859.34
Organism:Homo sapiens (Human)
Description:Stable expression of human CCK-1 receptors in HEK 293 cells.
Residue:428
BDBM50343721
NameBDBM50343721
Synonyms:3-(4-(4-(2-fluoro-4-methylphenyl)-5-(4-methoxyphenyl)pyrimidine-2-carbonyl)piperazin-1-yl)-1-naphthoic acid | CHEMBL1774043
TypeSmall organic molecule
Emp. Form.C34H29FN4O4
Mol. Mass.576.6169
SMILESCOc1ccc(cc1)-c1cnc(nc1-c1ccc(C)cc1F)C(=O)N1CCN(CC1)c1cc(C(O)=O)c2ccccc2c1