Reaction Details
TargetCholecystokinin receptor type A
LigandBDBM50343722
Substrate/Competitorn/a
Meas. Tech.ChEMBL_746073 (CHEMBL1775460)
IC50 0.034±n/a nM
Citation Wang, LHubert, JALee, SJPan, JQian, SReitman, MLStrack, AMWeingarth, DTMacNeil, DJWeber, AEEdmondson, SD Discovery of pyrimidine carboxamides as potent and selective CCK1 receptor agonists. Bioorg Med Chem Lett21:2911-5 (2011) 
 
Cholecystokinin receptor type A
Name:Cholecystokinin receptor type A
Type:G Protein-Coupled Receptor (GPCR)
Mol. Mass.:47859.34
Organism:Homo sapiens (Human)
Description:Stable expression of human CCK-1 receptors in HEK 293 cells.
Residue:428
BDBM50343722
NameBDBM50343722
Synonyms:3-(4-(5-(2,3-dihydrobenzo[b][1,4]dioxin-6-yl)-4-(2-fluoro-4-methylphenyl)pyrimidine-2-carbonyl)piperazin-1-yl)-1-naphthoic acid | CHEMBL1773877
TypeSmall organic molecule
Emp. Form.C35H29FN4O5
Mol. Mass.604.627
SMILESCc1ccc(c(F)c1)-c1nc(ncc1-c1ccc2OCCOc2c1)C(=O)N1CCN(CC1)c1cc(C(O)=O)c2ccccc2c1