Reaction Details
TargetTyrosine-protein kinase JAK2
LigandBDBM50343727
Substrate/Competitorn/a
Meas. Tech.ChEMBL_746713 (CHEMBL1776838)
IC50<3±n/a nM
Citation Wang, TIoannidis, SAlmeida, LBlock, MHDavies, AMLamb, MLScott, DASu, MZhang, HJAlimzhanov, MBebernitz, GBell, KZinda, M In vitro and in vivo evaluation of 6-aminopyrazolyl-pyridine-3-carbonitriles as JAK2 kinase inhibitors. Bioorg Med Chem Lett21:2958-61 (2011) 
 
Tyrosine-protein kinase JAK2
Name:Tyrosine-protein kinase JAK2
Type:Protein
Mol. Mass.:130684.68
Organism:Homo sapiens (Human)
Description:O60674
Residue:1132
BDBM50343727
NameBDBM50343727
Synonyms:(S)-5-chloro-2-(1-(5-fluoropyridin-2-yl)ethylamino)-6-(5-methyl-1H-pyrazol-3-ylamino)nicotinonitrile | CHEMBL1773082
TypeSmall organic molecule
Emp. Form.C17H15ClFN7
Mol. Mass.371.799
SMILESC[C@H](Nc1nc(Nc2cc(C)n[nH]2)c(Cl)cc1C#N)c1ccc(F)cn1