Reaction Details
TargetMuscle, skeletal receptor tyrosine-protein kinase
LigandBDBM50343726
Substrate/Competitorn/a
Meas. Tech.ChEMBL_746726 (CHEMBL1776851)
IC50 224±n/a nM
Citation Wang, TIoannidis, SAlmeida, LBlock, MHDavies, AMLamb, MLScott, DASu, MZhang, HJAlimzhanov, MBebernitz, GBell, KZinda, M In vitro and in vivo evaluation of 6-aminopyrazolyl-pyridine-3-carbonitriles as JAK2 kinase inhibitors. Bioorg Med Chem Lett21:2958-61 (2011) 
 
Muscle, skeletal receptor tyrosine-protein kinase
Name:Muscle, skeletal receptor tyrosine-protein kinase
Type:PROTEIN
Mol. Mass.:97062.85
Organism:Homo sapiens (Human)
Description:ChEMBL_1474077
Residue:869
BDBM50343726
NameBDBM50343726
Synonyms:(S)-5-fluoro-2-(1-(5-fluoropyridin-2-yl)ethylamino)-6-(5-methyl-1H-pyrazol-3-ylamino)nicotinonitrile | CHEMBL1774056
TypeSmall organic molecule
Emp. Form.C17H15F2N7
Mol. Mass.355.3447
SMILESC[C@H](Nc1nc(Nc2cc(C)n[nH]2)c(F)cc1C#N)c1ccc(F)cn1