Reaction Details
TargetPeroxisome proliferator-activated receptor gamma
LigandBDBM50085045
Substrate/Competitorn/a
Meas. Tech.ChEMBL_746399 (CHEMBL1776358)
EC50 1000±n/a nM
Citation Matsuda, HKogami, YNakamura, SSugiyama, TUeno, TYoshikawa, M Structural requirements of flavonoids for the adipogenesis of 3T3-L1 cells. Bioorg Med Chem19:2835-41 (2011) 
 
Peroxisome proliferator-activated receptor gamma
Name:Peroxisome proliferator-activated receptor gamma
Type:PROTEIN
Mol. Mass.:57593.55
Organism:Mus musculus
Description:ChEMBL_1453700
Residue:505
BDBM50085045
NameBDBM50085045
Synonyms:5-((4-((6-hydroxy-2,5,7,8-tetramethyl-3,4-dihydro-2H-chromen-2-yl)methoxy)phenyl)methyl)thiazolidine-2,4-dione 5-[4-(6-Hydroxy-2,5,7,8-tetramethyl-chroman-2-ylmethoxy)-benzy l]-thiazolidine-2,4-dione (troglitazone) 5-[4-(6-Hydroxy-2,5,7,8-tetramethyl-chroman-2-ylmethoxy)-benzyl]-thiazolidine-2,4-dione(troglitazone) CHEMBL408 CS-045 PRELAY TROGLITAZONE
TypeSmall organic molecule
Emp. Form.C24H27NO5S
Mol. Mass.441.54
SMILESCc1c(C)c2OC(C)(COc3ccc(Cc4sc(=O)[nH]c4O)cc3)CCc2c(C)c1O