Reaction Details
TargetSerine/threonine-protein kinase mTOR
LigandBDBM50343760
Substrate/Competitorn/a
Meas. Tech.ChEMBL_747578 (CHEMBL1777159)
Ki 10±n/a nM
Citation Cohen, FBergeron, PBlackwood, EBowman, KKChen, HDipasquale, AGEpler, JAKoehler, MFLau, KLewis, CLiu, LLy, CQMalek, SNonomiya, JOrtwine, DFPei, ZRobarge, KDSideris, STrinh, LTruong, TWu, JZhao, XLyssikatos, JP Potent, selective, and orally bioavailable inhibitors of mammalian target of rapamycin (mTOR) kinase based on a quaternary substituted dihydrofuropyrimidine. J Med Chem54:3426-35 (2011) 
 
Serine/threonine-protein kinase mTOR
Name:Serine/threonine-protein kinase mTOR
Type:Rapamycin target protein
Mol. Mass.:288917.12
Organism:Homo sapiens (Human)
Description:P42345
Residue:2549
BDBM50343760
NameBDBM50343760
Synonyms:1-ethyl-3-(4-(4-morpholino-7,8-dihydro-6H-pyrano[3,2-d]pyrimidin-2-yl)phenyl)urea | CHEMBL1774350
TypeSmall organic molecule
Emp. Form.C20H25N5O3
Mol. Mass.383.4442
SMILESCCNC(=O)Nc1ccc(cc1)-c1nc2CCCOc2c(n1)N1CCOCC1