Reaction Details
TargetSerine/threonine-protein kinase mTOR
LigandBDBM50343770
Substrate/Competitorn/a
Meas. Tech.ChEMBL_747578 (CHEMBL1777159)
Ki 3.6±n/a nM
Citation Cohen, FBergeron, PBlackwood, EBowman, KKChen, HDipasquale, AGEpler, JAKoehler, MFLau, KLewis, CLiu, LLy, CQMalek, SNonomiya, JOrtwine, DFPei, ZRobarge, KDSideris, STrinh, LTruong, TWu, JZhao, XLyssikatos, JP Potent, selective, and orally bioavailable inhibitors of mammalian target of rapamycin (mTOR) kinase based on a quaternary substituted dihydrofuropyrimidine. J Med Chem54:3426-35 (2011) 
 
Serine/threonine-protein kinase mTOR
Name:Serine/threonine-protein kinase mTOR
Type:Rapamycin target protein
Mol. Mass.:288917.12
Organism:Homo sapiens (Human)
Description:P42345
Residue:2549
BDBM50343770
NameBDBM50343770
Synonyms:1-((R)-2,3-Dihydroxypropyl)-3-(4-(7,7-dimethyl-4-((S)-3-methylmorpholino)-5,7-dihydrofuro[3,4-d]pyrimidin-2-yl)phenyl)urea | CHEMBL1774359
TypeSmall organic molecule
Emp. Form.C23H31N5O5
Mol. Mass.457.5227
SMILESC[C@H]1COCCN1c1nc(nc2c1COC2(C)C)-c1ccc(NC(=O)NC[C@@H](O)CO)cc1