Reaction Details
TargetSerine/threonine-protein kinase mTOR
LigandBDBM50343766
Substrate/Competitorn/a
Meas. Tech.ChEMBL_747584 (CHEMBL1777165)
IC50 4±n/a nM
Citation Cohen, FBergeron, PBlackwood, EBowman, KKChen, HDipasquale, AGEpler, JAKoehler, MFLau, KLewis, CLiu, LLy, CQMalek, SNonomiya, JOrtwine, DFPei, ZRobarge, KDSideris, STrinh, LTruong, TWu, JZhao, XLyssikatos, JP Potent, selective, and orally bioavailable inhibitors of mammalian target of rapamycin (mTOR) kinase based on a quaternary substituted dihydrofuropyrimidine. J Med Chem54:3426-35 (2011) 
 
Serine/threonine-protein kinase mTOR
Name:Serine/threonine-protein kinase mTOR
Type:Rapamycin target protein
Mol. Mass.:288917.12
Organism:Homo sapiens (Human)
Description:P42345
Residue:2549
BDBM50343766
NameBDBM50343766
Synonyms:(S)-1-(4-(7,7-Dimethyl-4-(3-methylmorpholino)-5,7-dihydrofuro[3,4-d]pyrimidin-2-yl)phenyl)-3-(2-hydroxyethyl)urea | CHEMBL1774355
TypeSmall organic molecule
Emp. Form.C22H29N5O4
Mol. Mass.427.4968
SMILESC[C@H]1COCCN1c1nc(nc2c1COC2(C)C)-c1ccc(NC(=O)NCCO)cc1