Reaction Details
TargetSerine/threonine-protein kinase mTOR
LigandBDBM50343772
Substrate/Competitorn/a
Meas. Tech.ChEMBL_747584 (CHEMBL1777165)
IC50 2.8±n/a nM
Citation Cohen, FBergeron, PBlackwood, EBowman, KKChen, HDipasquale, AGEpler, JAKoehler, MFLau, KLewis, CLiu, LLy, CQMalek, SNonomiya, JOrtwine, DFPei, ZRobarge, KDSideris, STrinh, LTruong, TWu, JZhao, XLyssikatos, JP Potent, selective, and orally bioavailable inhibitors of mammalian target of rapamycin (mTOR) kinase based on a quaternary substituted dihydrofuropyrimidine. J Med Chem54:3426-35 (2011) 
 
Serine/threonine-protein kinase mTOR
Name:Serine/threonine-protein kinase mTOR
Type:Rapamycin target protein
Mol. Mass.:288917.12
Organism:Homo sapiens (Human)
Description:P42345
Residue:2549
BDBM50343772
NameBDBM50343772
Synonyms:1-(4-((R)-7-(cyclopropylmethyl)-7-methyl-4-((S)-3-methylmorpholino)-5,7-dihydrofuro[3,4-d]pyrimidin-2-yl)phenyl)-3-ethylurea | CHEMBL1774361
TypeSmall organic molecule
Emp. Form.C25H33N5O3
Mol. Mass.451.5612
SMILESCCNC(=O)Nc1ccc(cc1)-c1nc2c(CO[C@]2(C)CC2CC2)c(n1)N1CCOC[C@@H]1C