Reaction Details
TargetSerine/threonine-protein kinase mTOR
LigandBDBM50343767
Substrate/Competitorn/a
Meas. Tech.ChEMBL_747582 (CHEMBL1777163)
IC50 30±n/a nM
Citation Cohen, FBergeron, PBlackwood, EBowman, KKChen, HDipasquale, AGEpler, JAKoehler, MFLau, KLewis, CLiu, LLy, CQMalek, SNonomiya, JOrtwine, DFPei, ZRobarge, KDSideris, STrinh, LTruong, TWu, JZhao, XLyssikatos, JP Potent, selective, and orally bioavailable inhibitors of mammalian target of rapamycin (mTOR) kinase based on a quaternary substituted dihydrofuropyrimidine. J Med Chem54:3426-35 (2011) 
 
Serine/threonine-protein kinase mTOR
Name:Serine/threonine-protein kinase mTOR
Type:Rapamycin target protein
Mol. Mass.:288917.12
Organism:Homo sapiens (Human)
Description:P42345
Residue:2549
BDBM50343767
NameBDBM50343767
Synonyms:(S)-1-(2-Cyanoethyl)-3-(4-(7,7-dimethyl-4-(3-methylmorpholino)-5,7-dihydrofuro[3,4-d]pyrimidin-2-yl)phenyl)urea | CHEMBL1774356
TypeSmall organic molecule
Emp. Form.C23H28N6O3
Mol. Mass.436.5068
SMILESC[C@H]1COCCN1c1nc(nc2c1COC2(C)C)-c1ccc(NC(=O)NCCC#N)cc1