Reaction Details
TargetPeptidyl-prolyl cis-trans isomerase NIMA-interacting 1
LigandBDBM50343856
Substrate/Competitorn/a
Meas. Tech.ChEMBL_747359 (CHEMBL1776704)
IC50 2900±n/a nM
Citation Zhu, LJin, JLiu, CZhang, CSun, YGuo, YFu, DChen, XXu, B Synthesis and biological evaluation of novel quinazoline-derived human Pin1 inhibitors. Bioorg Med Chem19:2797-807 (2011) 
 
Peptidyl-prolyl cis-trans isomerase NIMA-interacting 1
Name:Peptidyl-prolyl cis-trans isomerase NIMA-interacting 1
Type:PROTEIN
Mol. Mass.:18248.11
Organism:Homo sapiens (Human)
Description:ChEMBL_1502595
Residue:163
BDBM50343856
NameBDBM50343856
Synonyms:4-(2-(3-(3,4-Dichlorophenyl)ureido)-6-nitroquinazolin-4-ylamino)benzoic acid | CHEMBL1774790
TypeSmall organic molecule
Emp. Form.C22H14Cl2N6O5
Mol. Mass.513.29
SMILESOC(=O)c1ccc(Nc2nc(NC(=O)Nc3ccc(Cl)c(Cl)c3)nc3ccc(cc23)[N+]([O-])=O)cc1