Reaction Details
TargetP2Y purinoceptor 14
LigandBDBM50343872
Substrate/Competitorn/a
Meas. Tech.ChEMBL_747401 (CHEMBL1776795)
IC50 110±n/a nM
Citation Gauthier, JYBelley, MDeschênes, DFournier, JFGagné, SGareau, YHamel, MHénault, MHyjazie, HKargman, SLavallée, GLevesque, JFLi, LMamane, YMancini, JMorin, NMulrooney, ERobichaud, JThérien, MTranmer, GWang, ZWu, JBlack, WC The identification of 4,7-disubstituted naphthoic acid derivatives as UDP-competitive antagonists of P2Y14. Bioorg Med Chem Lett21:2836-9 (2011) 
 
P2Y purinoceptor 14
Name:P2Y purinoceptor 14
Type:PROTEIN
Mol. Mass.:38883.93
Organism:Mus musculus
Description:ChEMBL_745158
Residue:338
BDBM50343872
NameBDBM50343872
Synonyms:7-(2,6-dimethylbenzyloxy)-4-phenyl-2-naphthoic acid | CHEMBL1774887
TypeSmall organic molecule
Emp. Form.C26H22O3
Mol. Mass.382.4511
SMILESCc1cccc(C)c1COc1ccc2c(cc(cc2c1)C(O)=O)-c1ccccc1