Reaction Details
TargetP2Y purinoceptor 14
LigandBDBM50343878
Substrate/Competitorn/a
Meas. Tech.ChEMBL_747401 (CHEMBL1776795)
IC50 54±n/a nM
Citation Gauthier, JYBelley, MDeschênes, DFournier, JFGagné, SGareau, YHamel, MHénault, MHyjazie, HKargman, SLavallée, GLevesque, JFLi, LMamane, YMancini, JMorin, NMulrooney, ERobichaud, JThérien, MTranmer, GWang, ZWu, JBlack, WC The identification of 4,7-disubstituted naphthoic acid derivatives as UDP-competitive antagonists of P2Y14. Bioorg Med Chem Lett21:2836-9 (2011) 
 
P2Y purinoceptor 14
Name:P2Y purinoceptor 14
Type:PROTEIN
Mol. Mass.:38883.93
Organism:Mus musculus
Description:ChEMBL_745158
Residue:338
BDBM50343878
NameBDBM50343878
Synonyms:4-(thiophen-3-yl)-7-(4-(trifluoromethoxy)phenyl)-2-naphthoic acid | CHEMBL1774893
TypeSmall organic molecule
Emp. Form.C22H13F3O3S
Mol. Mass.414.397
SMILESOC(=O)c1cc(-c2ccsc2)c2ccc(cc2c1)-c1ccc(OC(F)(F)F)cc1