Reaction Details
TargetP2Y purinoceptor 14
LigandBDBM50343883
Substrate/Competitorn/a
Meas. Tech.ChEMBL_747401 (CHEMBL1776795)
IC50 190±n/a nM
Citation Gauthier, JYBelley, MDeschênes, DFournier, JFGagné, SGareau, YHamel, MHénault, MHyjazie, HKargman, SLavallée, GLevesque, JFLi, LMamane, YMancini, JMorin, NMulrooney, ERobichaud, JThérien, MTranmer, GWang, ZWu, JBlack, WC The identification of 4,7-disubstituted naphthoic acid derivatives as UDP-competitive antagonists of P2Y14. Bioorg Med Chem Lett21:2836-9 (2011) 
 
P2Y purinoceptor 14
Name:P2Y purinoceptor 14
Type:PROTEIN
Mol. Mass.:38883.93
Organism:Mus musculus
Description:ChEMBL_745158
Residue:338
BDBM50343883
NameBDBM50343883
Synonyms:4-(4-(methylsulfonyl)thiophen-3-yl)-7-(4-(trifluoromethyl)phenyl)-2-naphthoic acid | CHEMBL1774898
TypeSmall organic molecule
Emp. Form.C23H15F3O4S2
Mol. Mass.476.488
SMILESCS(=O)(=O)c1cscc1-c1cc(cc2cc(ccc12)-c1ccc(cc1)C(F)(F)F)C(O)=O