Reaction Details
TargetP2Y purinoceptor 14
LigandBDBM50343885
Substrate/Competitorn/a
Meas. Tech.ChEMBL_747401 (CHEMBL1776795)
IC50 13±n/a nM
Citation Gauthier, JYBelley, MDeschênes, DFournier, JFGagné, SGareau, YHamel, MHénault, MHyjazie, HKargman, SLavallée, GLevesque, JFLi, LMamane, YMancini, JMorin, NMulrooney, ERobichaud, JThérien, MTranmer, GWang, ZWu, JBlack, WC The identification of 4,7-disubstituted naphthoic acid derivatives as UDP-competitive antagonists of P2Y14. Bioorg Med Chem Lett21:2836-9 (2011) 
 
P2Y purinoceptor 14
Name:P2Y purinoceptor 14
Type:PROTEIN
Mol. Mass.:38883.93
Organism:Mus musculus
Description:ChEMBL_745158
Residue:338
BDBM50343885
NameBDBM50343885
Synonyms:4-(4-(2,2,2-trifluoro-1-hydroxyethyl)phenyl)-7-(4-(trifluoromethyl)phenyl)-2-naphthoic acid | CHEMBL1774900
TypeSmall organic molecule
Emp. Form.C26H16F6O3
Mol. Mass.490.3939
SMILESOC(c1ccc(cc1)-c1cc(cc2cc(ccc12)-c1ccc(cc1)C(F)(F)F)C(O)=O)C(F)(F)F