Reaction Details
TargetP2Y purinoceptor 14
LigandBDBM50343888
Substrate/Competitorn/a
Meas. Tech.ChEMBL_747401 (CHEMBL1776795)
IC50 8±n/a nM
Citation Gauthier, JYBelley, MDeschênes, DFournier, JFGagné, SGareau, YHamel, MHénault, MHyjazie, HKargman, SLavallée, GLevesque, JFLi, LMamane, YMancini, JMorin, NMulrooney, ERobichaud, JThérien, MTranmer, GWang, ZWu, JBlack, WC The identification of 4,7-disubstituted naphthoic acid derivatives as UDP-competitive antagonists of P2Y14. Bioorg Med Chem Lett21:2836-9 (2011) 
 
P2Y purinoceptor 14
Name:P2Y purinoceptor 14
Type:PROTEIN
Mol. Mass.:38883.93
Organism:Mus musculus
Description:ChEMBL_745158
Residue:338
BDBM50343888
NameBDBM50343888
Synonyms:(R)-4-(4-(2,2-difluoro-1-hydroxyethyl)phenyl)-7-(4-(trifluoromethyl)phenyl)-2-naphthoic acid | CHEMBL1774903
TypeSmall organic molecule
Emp. Form.C26H17F5O3
Mol. Mass.472.4034
SMILESO[C@@H](C(F)F)c1ccc(cc1)-c1cc(cc2cc(ccc12)-c1ccc(cc1)C(F)(F)F)C(O)=O